Short pages

Jump to: navigation, search

Showing below up to 250 results starting with #1.

View (previous 250 | next 250) (20 | 50 | 100 | 250 | 500)

  1. (hist) ‎Test KB Post ‎[34 bytes]
  2. (hist) ‎Problems with Excel when Running Reports ‎[57 bytes]
  3. (hist) ‎Running a batch report ‎[77 bytes]
  4. (hist) ‎Excel 2007 Specifications PivotTable Report Specifications ‎[98 bytes]
  5. (hist) ‎Sage intelligence reporting for Sage ERP X3 release notes ‎[115 bytes]
  6. (hist) ‎Creating a Pervasive ODBC Connection for Files on a Server ‎[128 bytes]
  7. (hist) ‎Scheduling a Report ‎[146 bytes]
  8. (hist) ‎Installation Guide - Financial Reporting for Sage ERP X3 ‎[167 bytes]
  9. (hist) ‎ODBC Connection for Pervasive.SQL 2000/2000i ‎[177 bytes]
  10. (hist) ‎The Microsoft.Jet.OLEDB.4.0'provider is not registered on the local machine ‎[178 bytes]
  11. (hist) ‎Clear lookup sheet ‎[178 bytes]
  12. (hist) ‎Hotkey for "Run as administrator" Windows Vista, 7, 2008 ‎[182 bytes]
  13. (hist) ‎Locking and Unlocking a report ‎[190 bytes]
  14. (hist) ‎Permission rights to Alchemex ‎[193 bytes]
  15. (hist) ‎Working with PR1 files ‎[197 bytes]
  16. (hist) ‎Remove Blank Rows in Excel ‎[197 bytes]
  17. (hist) ‎Excel 2003 missing Add- ins ‎[215 bytes]
  18. (hist) ‎Alchemex add-ins missing from the toolbar in Excel ‎[220 bytes]
  19. (hist) ‎Steps to find container belonging to a report ‎[242 bytes]
  20. (hist) ‎Dongle size does not match ‎[250 bytes]
  21. (hist) ‎SQL Deadlock Error ‎[270 bytes]
  22. (hist) ‎Pastel Partner - period 13 not pulling through when creating layout ‎[273 bytes]
  23. (hist) ‎Error: Cannot access BIM reports when using an ACCUTHIN runtime. ‎[275 bytes]
  24. (hist) ‎Invalid Procedure call or argument ‎[280 bytes]
  25. (hist) ‎Error: "The Page Cannot be Found” ‎[283 bytes]
  26. (hist) ‎Error: Pastel Evolution BIC PR1s failing if dash characters in name ‎[284 bytes]
  27. (hist) ‎Compact Metadata Functionality ‎[285 bytes]
  28. (hist) ‎Sybase System connection ‎[289 bytes]
  29. (hist) ‎Genie not licenced ‎[301 bytes]
  30. (hist) ‎Not wanting to create a Pivot from your raw data ‎[311 bytes]
  31. (hist) ‎Import Failed Syntax error(missing operator) ‎[316 bytes]
  32. (hist) ‎Intelligence DrillDown does not work on Accounts with masking ‎[317 bytes]
  33. (hist) ‎Error: 127 – TSAC32.DLL ‎[339 bytes]
  34. (hist) ‎Data provider or other service returned an E FAIL status ‎[341 bytes]
  35. (hist) ‎COMMAND LINE OPTION SYNTAX ERROR. TYPE COMMAND FOR HELP ‎[342 bytes]
  36. (hist) ‎Add property of workbook class failed ‎[351 bytes]
  37. (hist) ‎Financial Report Designer hangs at Naming Ranges and Excel does not respond ‎[354 bytes]
  38. (hist) ‎Sage Intelligence: Out of memory ‎[354 bytes]
  39. (hist) ‎Locking/Unlocking a Report ‎[359 bytes]
  40. (hist) ‎UNABLE TO GET THE ADD PROPERTY OF THE WORKBOOK CLASS ‎[359 bytes]
  41. (hist) ‎Error when launching Report Manager ‎[360 bytes]
  42. (hist) ‎Multiple-step operation generated errors. Check each status value ‎[361 bytes]
  43. (hist) ‎Distribution error: Object reference not set to an instance of an object ‎[362 bytes]
  44. (hist) ‎Error Number2147217887 Description Multiple-step operation generated errors. Check each status value. Source Microsoft Cursor Engine ‎[364 bytes]
  45. (hist) ‎ISSUE: Alchemex FA Error for Microsoft Office 64 Bit ‎[364 bytes]
  46. (hist) ‎Dates in Excel are formatting as numbers rather than as dates ‎[366 bytes]
  47. (hist) ‎Steps to enable cookies on your Web Browser ‎[368 bytes]
  48. (hist) ‎Sage 100 .Net Error ‎[368 bytes]
  49. (hist) ‎Error: Data provider or other service returned an E FAIL status ‎[370 bytes]
  50. (hist) ‎Error: FILE: \\Share\Projback\PRE STATUS: 35, 00 File not found on Drive (Open)…*. ‎[372 bytes]
  51. (hist) ‎Instructions for moving SMI 4.4 to a different location after Performance Patch has been applied ‎[373 bytes]
  52. (hist) ‎Report run keeps prompting to enter SQL database credentials ‎[373 bytes]
  53. (hist) ‎THE SPECIFIED FILE FORMAT IS NOT KNOWN ‎[376 bytes]
  54. (hist) ‎Using the Integrated Management Pack “Type D” Drill-down ‎[377 bytes]
  55. (hist) ‎How to view auto connection details ‎[378 bytes]
  56. (hist) ‎Error when Distributing ‎[378 bytes]
  57. (hist) ‎BUDGET YTD 10 EXPRESSION ISSUE ‎[379 bytes]
  58. (hist) ‎Error: 126 & 127 VIP BIM ‎[381 bytes]
  59. (hist) ‎Steps to add a company in Pastel Partner ‎[382 bytes]
  60. (hist) ‎Error ODBC SQL Server Driver - Login failed ‎[383 bytes]
  61. (hist) ‎How to increase Report Parameter when limited to 2000 rows ‎[384 bytes]
  62. (hist) ‎Item cannot be found in the collection ‎[385 bytes]
  63. (hist) ‎Error “This user is not authorised to use this method” when logging into Sage One Intelligence Reporting. ‎[385 bytes]
  64. (hist) ‎Error: Cannot create\open drive H:\...*. ‎[386 bytes]
  65. (hist) ‎Error: VIP says that your VIP ODBC drivers have not been installed when attempting to access BIM. ‎[388 bytes]
  66. (hist) ‎Error: Class does not support Automation or does not support expected interfac Licence Manager ‎[390 bytes]
  67. (hist) ‎Error: Export Failed: Invalid File Name ‎[390 bytes]
  68. (hist) ‎Uninstalling Alchemex Request Server ‎[390 bytes]
  69. (hist) ‎Registration Error 53 File not found ‎[395 bytes]
  70. (hist) ‎Error: Not Available in Visual Foxpro 9 OLEDB ‎[398 bytes]
  71. (hist) ‎Run a Macro by Clicking a Cell in Excel ‎[398 bytes]
  72. (hist) ‎Pervasive ODBC Client Interface Client LNA The ODBC Client interface cannot access the data source because SQL Connection Manager is not running at the specified port number.Contact your system administrator for assistance. SQLState 08S01 ‎[399 bytes]
  73. (hist) ‎Uninstalling Alchemex Web Application ‎[402 bytes]
  74. (hist) ‎Error: 429 It was not possible to run an object (PLINOUT.PLExpand).It is possible that certain libraries are missing on this workstation.The error returned was ActiveX component can’t create object ‎[403 bytes]
  75. (hist) ‎Multiple-step operation generated errors Check each status value. ‎[407 bytes]
  76. (hist) ‎ERROR OCCURRED ATTEMPTING TO GENERATE CUBE ‎[408 bytes]
  77. (hist) ‎Sage Accpac Intelligence:The cube failed to generate.OLE DB error OLE DB or ODBC error. ‎[409 bytes]
  78. (hist) ‎SQL timeout on ETL ‎[409 bytes]
  79. (hist) ‎Provider Cannot be Found ‎[409 bytes]
  80. (hist) ‎Invalid procedure call or argument error ‎[412 bytes]
  81. (hist) ‎Error:Transoft TSENG32 Unable to open file: EMP INFO FIXED. ‎[413 bytes]
  82. (hist) ‎Error: Stored Procedures - Supported Database Systems ‎[417 bytes]
  83. (hist) ‎UNEXPECTED ERROR PERMISSION DENIED ‎[418 bytes]
  84. (hist) ‎Error: Application-defined or object-defined error ‎[421 bytes]
  85. (hist) ‎Error: Container Protection in Pastel Partner BIC not Working ‎[424 bytes]
  86. (hist) ‎The download file PLDONGLE.DLL is empty ‎[424 bytes]
  87. (hist) ‎How to create a 32 bit ODBC driver on a 64 bit machine ‎[427 bytes]
  88. (hist) ‎How to clear additional ranges ‎[427 bytes]
  89. (hist) ‎Microsoft ODBC Driver Manager Data source name not found and no default driver specified ‎[430 bytes]
  90. (hist) ‎Error occurred during email publish in Distribution instruction ‎[431 bytes]
  91. (hist) ‎UNABLE TO CONNECT DATA SOURCE NAME NOT FOUND AND NO DEFAULT DRIVER SPECIFIED ‎[434 bytes]
  92. (hist) ‎Unable to run reports on SQL server on french ‎[439 bytes]
  93. (hist) ‎Not a valid Win32 Application error ‎[445 bytes]
  94. (hist) ‎Error: The key number parameter is invalid(Btrieve Error 6) ‎[447 bytes]
  95. (hist) ‎Error: Unexpected error trying to check library registration. ‎[447 bytes]
  96. (hist) ‎Sage Intelligence: “Dashboard Analysis AR 3-8 does not balance against Sage 300 Trial Balance” ‎[448 bytes]
  97. (hist) ‎Destination reference error when creating a Pivot table ‎[450 bytes]
  98. (hist) ‎Invoice amount doubled on AR Invoice Aging Report in Sage Intelligence ‎[456 bytes]
  99. (hist) ‎Error: OLE DB error: OLE DB or ODBC error -2147467259 when executing a cube in the OLAP Manager ‎[459 bytes]
  100. (hist) ‎Error: Could not use "; file already in use ‎[461 bytes]
  101. (hist) ‎Error: Excel row limit being incorrectly reported for Union Reports ‎[462 bytes]
  102. (hist) ‎WEB REPORTING MODULE IS NOT REGISTERED OR DATABASE NAME IS INCORRECT ‎[462 bytes]
  103. (hist) ‎ERROR 1603 ‎[462 bytes]
  104. (hist) ‎Consolidated Report Designer Add-in (RDA) does not consolidate ‎[463 bytes]
  105. (hist) ‎How to manually add a licence ‎[464 bytes]
  106. (hist) ‎Report designer not licensed in RDA formula cells ‎[464 bytes]
  107. (hist) ‎An unknown error status is returned after upgrading to Pervasive SQL version 9. ‎[466 bytes]
  108. (hist) ‎Error 1330. A file that is required cannot be installed because the cabinet file has an invalid digital signature. This may indicate that the cabinet file is corrupt. ‎[467 bytes]
  109. (hist) ‎A Machine date discontinuity has invalidated serialisation details.You will need to re-serialise Alchemex.Please contact your administrator to perform re-serialisation ‎[468 bytes]
  110. (hist) ‎BI Generator Add-in missing in excel advanced options ‎[468 bytes]
  111. (hist) ‎MULTI – STEP OPERATION GENERATED ERRORS ‎[469 bytes]
  112. (hist) ‎Incorrect values on Sales Master 4-5 ‎[469 bytes]
  113. (hist) ‎Error: "Invalid Authorization Specification" when trying to drilldown to transaction level ‎[472 bytes]
  114. (hist) ‎Error: Unexpected error; quitting when running PLMAINT.exe ‎[475 bytes]
  115. (hist) ‎Error in loading DLL on Sage Pastel ‎[476 bytes]
  116. (hist) ‎Pastel Auditor journal export to Pastel Evolution does not export contra account adjustments ‎[478 bytes]
  117. (hist) ‎Sage Intelligence: "Un-posted invoices reflecting in Sales Master AR 3-6" ‎[478 bytes]
  118. (hist) ‎Error: Sage MAS 500 – Financial Reports 2-0 (MAS 500) Report ‎[481 bytes]
  119. (hist) ‎Paste method of worksheet class failed ‎[483 bytes]
  120. (hist) ‎Sage ERP X3 If 3 dimensions are selected at runtiime, not all correct data is returned ‎[483 bytes]
  121. (hist) ‎Importing and exporting reports ‎[488 bytes]
  122. (hist) ‎Error: You do not have sufficient Registry Windows permissions to utilize the Free Trial period of AlchemexVIP. Read from Registry Key: HKey Local Machines\Software\AlchemexVIP ‎[489 bytes]
  123. (hist) ‎Unable to distribute a report via bitools ‎[495 bytes]
  124. (hist) ‎Error: The Value 'YES' is invalid for the Data Type of the field 'Sales Order Closed?' ‎[496 bytes]
  125. (hist) ‎Task pane does not filter companies according to company selector when reports are run out for multiple companies ‎[496 bytes]
  126. (hist) ‎Disk or Network error ‎[497 bytes]
  127. (hist) ‎QUICK GENERATE AND QUICK EDIT MENUS BLANK/MISSING ‎[498 bytes]
  128. (hist) ‎Corflags ‎[499 bytes]
  129. (hist) ‎Auto connect popup appears while starting any Sage Intelligence Reporting modules ‎[500 bytes]
  130. (hist) ‎Viewing the SQL code passed by Alchemex to the ODBC Driver ‎[506 bytes]
  131. (hist) ‎Keyword not supported 'driver' ‎[507 bytes]
  132. (hist) ‎Error: "Report designer license required" Error occurs while running Sage Intellgence in Sage 300 ERP" ‎[507 bytes]
  133. (hist) ‎External content links on home page in reports are broken ‎[507 bytes]
  134. (hist) ‎FINALISERETINC FAILED ERROR ‎[509 bytes]
  135. (hist) ‎Sage Intelligent Reporting: Report name does not change on the report list when it has been changed on the report ‎[510 bytes]
  136. (hist) ‎PROBLEM LOADING DATA WHEN RUNNING CONSOLIDATION REPORT DESIGNER ADD-IN ‎[512 bytes]
  137. (hist) ‎SQL statement is not of the type SELECT ‎[513 bytes]
  138. (hist) ‎Evolution Branch Code ‎[514 bytes]
  139. (hist) ‎CUSTOMER DELIVERY ADDRESS IS ADDED INTO THE REPORT, HOWEVER ONCE THE REPORT IS RUN THESE DETAILS DO NOT DISPLAY ON THE REPORT ‎[515 bytes]
  140. (hist) ‎It was not possible to write to the Metadata Repository.Please make sure there are sufficient user permissions on the Alchemex.svd file and that the file attributes are not set to read only. ‎[516 bytes]
  141. (hist) ‎Error: -2147467259 Operation must use an updateable query ‎[516 bytes]
  142. (hist) ‎Error: Pastel Evolution 6.5 Sales Master 3-5 Container Expression Updates ‎[517 bytes]
  143. (hist) ‎Error: Sage MAS90 – Financial Trend Analysis 2-0 (MAS) Report Financial Trend Analysis 2-0 (MAS) the Date Lookup worksheet is displaying the incorrect years - 1900 & 1899 ‎[519 bytes]
  144. (hist) ‎Error: Timeout settings for Containers and Connections not working when within the Administrator Tool ‎[520 bytes]
  145. (hist) ‎Report designer add-in (RDA) does not recognize characters that are not “-“ used to separate account segments ‎[522 bytes]
  146. (hist) ‎Task pane does not launch running a Financial Report Designer ‎[529 bytes]
  147. (hist) ‎Sage Pastel company load is slow ‎[531 bytes]
  148. (hist) ‎Joins in Pervasive SQL can sometimes be order specific. ‎[534 bytes]
  149. (hist) ‎Updating existing reports to use Accpac 5.5 containers. ‎[536 bytes]
  150. (hist) ‎Unable to allocate licences ‎[537 bytes]
  151. (hist) ‎Logon has been disabled by your VAR ‎[538 bytes]
  152. (hist) ‎The function MailSMTP failed. ‎[539 bytes]
  153. (hist) ‎Error: Runtime error 13 – Unexpected error occurred – Type Mismatch. ‎[540 bytes]
  154. (hist) ‎Switching MetaData Sets ‎[540 bytes]
  155. (hist) ‎The Alchemex Library DateDimensionBuilder.dllDate Dimension Creation Toolis not installed or registered ‎[541 bytes]
  156. (hist) ‎Error : Could not load file or assembly 'ADODB, Version=7.0.3300.0, Culture=neutral, PublicKeyToken=b03f5f7f11d50a3a' or one of its dependencies ‎[542 bytes]
  157. (hist) ‎ERROR Report designer license required ‎[543 bytes]
  158. (hist) ‎Auto Connect Information ‎[547 bytes]
  159. (hist) ‎Serialisation check failed ‎[547 bytes]
  160. (hist) ‎Unable to delete containers in Connector ‎[549 bytes]
  161. (hist) ‎Report Designer Layout Generator not including opening balance amount for Actual YTD Column ‎[550 bytes]
  162. (hist) ‎UNEXPECTED ERROR OBJECT REFERENCE NOT SET TO AN OBJECT ‎[553 bytes]
  163. (hist) ‎Macros called from an Alchemex report that has string parameters that include the comma character fail. ‎[554 bytes]
  164. (hist) ‎Export failed due to unexpected error.The error was Compress.exe error ‎[555 bytes]
  165. (hist) ‎DRILL DOWN ERROR CONVERSION FAILED WHEN CONVERTING VARCHAR VALUE ‎[555 bytes]
  166. (hist) ‎When viewing the Finacial Report Designer 1-0 (Evo) report with Microsoft Office 2013 the amounts and totals do not display. ‎[555 bytes]
  167. (hist) ‎Report "hangs" or "freezes" ‎[556 bytes]
  168. (hist) ‎Scalable SQL cannot create external index file ‎[557 bytes]
  169. (hist) ‎Actuals Formula not bringing through values ‎[557 bytes]
  170. (hist) ‎Internal Error 2753. F7673 PLASOCFILE.EXE ‎[559 bytes]
  171. (hist) ‎Error: Named Ranges and Excel Formulae not working in raw data sheets where the sheet name includes a space character ‎[561 bytes]
  172. (hist) ‎BI Report Distribution by mail fails ‎[562 bytes]
  173. (hist) ‎How to register ALWrapper and ALDBConvert ‎[564 bytes]
  174. (hist) ‎Unable to save Distribution Instructions ‎[564 bytes]
  175. (hist) ‎Upgrading Sybiz BIC Management Packs from v2-3 to v3-0 ‎[568 bytes]
  176. (hist) ‎Registering the Alchemex COM Server ‎[569 bytes]
  177. (hist) ‎THE OUTPUT TEMPLATE FILE IS MISSING ‎[569 bytes]
  178. (hist) ‎It was not possible to write to the MetaData Repository ‎[569 bytes]
  179. (hist) ‎Version 11 of Excel does not support files of type ‎[570 bytes]
  180. (hist) ‎Drill Down Problem ‎[575 bytes]
  181. (hist) ‎Error: "Could not find the associated application for file type htm Source : GetAssosciatedEXE" occurring when try to preview a report in the Community ‎[576 bytes]
  182. (hist) ‎Error: Can't create ActiveX object. ‎[576 bytes]
  183. (hist) ‎The system variable @SYSTEMUSER@ does not work when being used in the expression source of a pass through variable. ‎[576 bytes]
  184. (hist) ‎Sage 500 Report Designer Add-in (RDA): Opening and Closing Balance formulas produced the same result ‎[577 bytes]
  185. (hist) ‎Company Name showing up twice on the Report Designer Add-In report causing error with the data in the report ‎[580 bytes]
  186. (hist) ‎Starting and Stopping Pervasive.SQL Workstation Engines ‎[581 bytes]
  187. (hist) ‎Error: ODBC Drivers not installed when trying to access the BIM. ‎[584 bytes]
  188. (hist) ‎Error: Unable to get Add property of Workbook class occurring after upgrading to Excel 2007 ‎[586 bytes]
  189. (hist) ‎Pervasive SoftwareODBC InterfacePervasive Software SQL EngineGeneral error ‎[587 bytes]
  190. (hist) ‎CURRENT PROVIDER DOES NOT SUPPORT ASYNCHRONOUS EXECUTION ‎[587 bytes]
  191. (hist) ‎Alchemex FA Error ‎[590 bytes]
  192. (hist) ‎Error 1606: Could not access network location \ASP.NETClientFiles\. ‎[593 bytes]
  193. (hist) ‎Report Designer Drilldown report missing ‎[597 bytes]
  194. (hist) ‎INCORRECT DETAIL FOR FISCAL PERIOD SEPT ‎[600 bytes]
  195. (hist) ‎Error "alchemexpolicy.exe is not marked for installation" occurs during installation of Sage 100 Intelligence ‎[600 bytes]
  196. (hist) ‎Multiple-step operation generated errors. Check each status value. ‎[601 bytes]
  197. (hist) ‎System Variables ‎[602 bytes]
  198. (hist) ‎Application defined or object defined error ‎[602 bytes]
  199. (hist) ‎Error: Number -1147181502 Could not find - file Unknown ‎[603 bytes]
  200. (hist) ‎Error: Not Available ‎[603 bytes]
  201. (hist) ‎The file alchemexpolicy.exe is not marked for installation ‎[604 bytes]
  202. (hist) ‎Upgrading Sybiz BIC Sales Master from v2-1 to v3-0 ‎[605 bytes]
  203. (hist) ‎Error: Error Number : 75 ‎[606 bytes]
  204. (hist) ‎Error “Unable to create specified activex object” in Report manager on a windows 8 environment ‎[607 bytes]
  205. (hist) ‎RECEIVING AN ERROR WHEN TRYING TO DO A FRX CONVERSION WITH A LARGE REPORTING TREE ‎[608 bytes]
  206. (hist) ‎Error: Accpac – Dashboard Analysis 3-1 (AE-SQL) Incorrect calculations ‎[609 bytes]
  207. (hist) ‎OUTPUT TEMPLATE FILE ERROR ‎[610 bytes]
  208. (hist) ‎How to Change the Decimal Place in Cells in Microsoft Excel 2003 ‎[612 bytes]
  209. (hist) ‎Renaming a Data Connection ‎[613 bytes]
  210. (hist) ‎Error: Pastel Partner – Sales Master 2-1 (P v11) Report ‎[614 bytes]
  211. (hist) ‎Object reference not set to an instance of an object ‎[616 bytes]
  212. (hist) ‎Any formating done on a report will not retain if done on sheet 1 ‎[616 bytes]
  213. (hist) ‎Class factory cannot supply requested class ‎[618 bytes]
  214. (hist) ‎Data not pulling through ‎[619 bytes]
  215. (hist) ‎Error: "Run Time Error '-2147024769 (8007007f)': Method '~' of object '~' failed." occurring when launching Alchemex ‎[621 bytes]
  216. (hist) ‎X3 Data not rendered to Sheet 1 ‎[621 bytes]
  217. (hist) ‎When viewing the Sales Master 4-5 (EVO) Report inventory items which are inactive do not display on the report ‎[621 bytes]
  218. (hist) ‎Error: Pastel Partner – Purchase Master 2-0 (P v11) Report ‎[622 bytes]
  219. (hist) ‎Upgrading Sybiz BIC Purchase Master from v2-0 to v3-0 ‎[624 bytes]
  220. (hist) ‎ERROR 1904 HRESULT BICOMPONENTS FAILED TO REGISTER ‎[624 bytes]
  221. (hist) ‎Error 1001 ‎[626 bytes]
  222. (hist) ‎Sage Intelligence: Budget numbers not showing on french Financial Analysis Report ‎[626 bytes]
  223. (hist) ‎Error: True account quantity not showing on Report Designer Add-in Report / Financial Report designer ‎[627 bytes]
  224. (hist) ‎Financial Report Designer 1-1 does not balance to the ERP Report. ‎[628 bytes]
  225. (hist) ‎Error: "Permission / Access denied" Opening Sage Intelligence modules ‎[631 bytes]
  226. (hist) ‎Rowset does not support fetching backward ‎[634 bytes]
  227. (hist) ‎SAGE 500 – MANAGEMENT PACK – PERIOD 13 DOES NOT DISPLAY WHEN USING THE CHANGE PERIOD ‎[637 bytes]
  228. (hist) ‎Error 6 Over flow ‎[637 bytes]
  229. (hist) ‎The job cost are showing multiple times ‎[637 bytes]
  230. (hist) ‎Error: Export failed due to unexpected error. ‎[638 bytes]
  231. (hist) ‎Error: Database Name disappears in Object Window when adding new Database Name ‎[638 bytes]
  232. (hist) ‎Error:Method ‘Value’ of object ‘Range’ failed ‎[638 bytes]
  233. (hist) ‎Error: Page Cannot be Displayed - Error Type: "Invalid Class String" ‎[640 bytes]
  234. (hist) ‎Error reading setup initialization file ‎[641 bytes]
  235. (hist) ‎Evolution & Partner Report Designer issue ‎[641 bytes]
  236. (hist) ‎Error: "Data Record manager, Rqeuired information for binding rule is missing" ‎[642 bytes]
  237. (hist) ‎Error: "has been invalidated. A Hack alert has been raised. cannot continue to function without a valid license. ‎[643 bytes]
  238. (hist) ‎Data source name not found and no default driver specified ‎[644 bytes]
  239. (hist) ‎Scheduled Report Mail Distribution Issue ‎[645 bytes]
  240. (hist) ‎Error: Pastel Evolution – DashBoard - Products 3-5 (Evo) Report and DashBoard - Customers 3-5 (Evo) Report ‎[648 bytes]
  241. (hist) ‎FRX tree conversion assistant, Error: Object reference not set to an instance of an object ‎[651 bytes]
  242. (hist) ‎Outgoing mail server does not exist or cannot be reached ‎[651 bytes]
  243. (hist) ‎Spaces required for multiple account selection ‎[651 bytes]
  244. (hist) ‎When the user runs any Financial Reports, the BI Tools cannot be loaded. ‎[652 bytes]
  245. (hist) ‎Quantity is double in the Purchase Master report ‎[653 bytes]
  246. (hist) ‎Excel Pivot table limits. ‎[654 bytes]
  247. (hist) ‎Aggregate Filter ‎[654 bytes]
  248. (hist) ‎Error: Accpac 5.6 – Consolidated Financials S-3-0 (AE-PVS) fails to run when one of the company/databases have no transactions posted. ‎[655 bytes]
  249. (hist) ‎Management Pack 13th period missing ‎[655 bytes]
  250. (hist) ‎Fiscal Year data missing from the Fianancial Report Designer ‎[655 bytes]

View (previous 250 | next 250) (20 | 50 | 100 | 250 | 500)